Information card for entry 4342227
Formula | C54 H43 Cl6 N2 P2 Rh |
Calculated formula | C54 H43 Cl6 N2 P2 Rh |
Title of publication | Orthometalation of Dibenzo[1,2]quinoxaline with Ruthenium(II/III), Osmium(II/III/IV), and Rhodium(III) Ions and Orthometalated [RuNO](6/7) Derivatives. |
Authors of publication | Maity, Suvendu; Kundu, Suman; Saha Roy, Amit; Weyhermüller, Thomas; Ghosh, Prasanta |
Journal of publication | Inorganic chemistry |
Year of publication | 2015 |
Journal volume | 54 |
Journal issue | 4 |
Pages of publication | 1384 - 1394 |
a | 11.876 ± 0.003 Å |
b | 13.325 ± 0.002 Å |
c | 29.659 ± 0.003 Å |
α | 90° |
β | 96.562 ± 0.013° |
γ | 90° |
Cell volume | 4662.7 ± 1.5 Å3 |
Cell temperature | 100 ± 2 K |
Ambient diffraction temperature | 100 ± 2 K |
Number of distinct elements | 6 |
Space group number | 14 |
Hermann-Mauguin space group symbol | P 1 21/c 1 |
Hall space group symbol | -P 2ybc |
Residual factor for all reflections | 0.0635 |
Residual factor for significantly intense reflections | 0.0407 |
Weighted residual factors for significantly intense reflections | 0.0883 |
Weighted residual factors for all reflections included in the refinement | 0.0989 |
Goodness-of-fit parameter for all reflections included in the refinement | 1.044 |
Diffraction radiation wavelength | 0.71073 Å |
Diffraction radiation type | MoKα |