Information card for entry 4342229
Formula | C52 H58 As8 Cu4 N8 O43 V14 |
Calculated formula | C52 H56 As8 Cu4 N8 O43 V14 |
Title of publication | Copper-Organic Cationic Ring with an Inserted Arsenic-Vanadium Polyanionic Cluster for Efficient Catalytic Cr(VI) Reduction Using Formic Acid. |
Authors of publication | He, Xue-Li; Liu, Yun-Ping; Gong, Kai-Ning; Han, Zhan-Gang; Zhai, Xue-Liang |
Journal of publication | Inorganic chemistry |
Year of publication | 2015 |
Journal volume | 54 |
Journal issue | 4 |
Pages of publication | 1215 - 1217 |
a | 12.0877 ± 0.0018 Å |
b | 12.4169 ± 0.0018 Å |
c | 16.301 ± 0.0018 Å |
α | 106.261 ± 0.002° |
β | 109.509 ± 0.002° |
γ | 93.014 ± 0.002° |
Cell volume | 2184.9 ± 0.5 Å3 |
Cell temperature | 296 ± 2 K |
Ambient diffraction temperature | 296 ± 2 K |
Number of distinct elements | 7 |
Space group number | 2 |
Hermann-Mauguin space group symbol | P -1 |
Hall space group symbol | -P 1 |
Residual factor for all reflections | 0.0809 |
Residual factor for significantly intense reflections | 0.0625 |
Weighted residual factors for significantly intense reflections | 0.162 |
Weighted residual factors for all reflections included in the refinement | 0.1728 |
Goodness-of-fit parameter for all reflections included in the refinement | 1.032 |
Diffraction radiation wavelength | 0.71073 Å |
Diffraction radiation type | MoKα |