Information card for entry 4342240
Formula | C40 H32 F12 O10 Ru2 |
Calculated formula | C40 H32 F12 O10 Ru2 |
SMILES | C1(c2ccccc2C(F)(F)F)=[O][Ru]234([O]=C(O[Ru]4(O1)([O]=C(c1ccccc1C(F)(F)F)O2)([O]=C(O3)c1ccccc1C(F)(F)F)[O]1CCCC1)c1ccccc1C(F)(F)F)[O]1CCCC1 |
Title of publication | Fully Electron-Transferred Donor/Acceptor Layered Frameworks with TCNQ(2-). |
Authors of publication | Kosaka, Wataru; Morita, Takaumi; Yokoyama, Taiga; Zhang, Jun; Miyasaka, Hitoshi |
Journal of publication | Inorganic chemistry |
Year of publication | 2015 |
Journal volume | 54 |
Journal issue | 4 |
Pages of publication | 1518 - 1527 |
a | 10.465 ± 0.003 Å |
b | 19.206 ± 0.005 Å |
c | 10.847 ± 0.003 Å |
α | 90° |
β | 105.236 ± 0.004° |
γ | 90° |
Cell volume | 2103.5 ± 1 Å3 |
Cell temperature | 93 K |
Ambient diffraction temperature | 93 K |
Number of distinct elements | 5 |
Space group number | 14 |
Hermann-Mauguin space group symbol | P 1 21/n 1 |
Hall space group symbol | -P 2yn |
Residual factor for all reflections | 0.0508 |
Residual factor for significantly intense reflections | 0.0442 |
Weighted residual factors for significantly intense reflections | 0.121 |
Weighted residual factors for all reflections included in the refinement | 0.1264 |
Goodness-of-fit parameter for all reflections included in the refinement | 0.997 |
Diffraction radiation wavelength | 0.7107 Å |
Diffraction radiation type | MoKα |