Information card for entry 4342266
Formula | C83 H61 Cl9 N20 Ni2 |
Calculated formula | C83 H61 Cl9 N20 Ni2 |
Title of publication | Assembly, disassembly, and reassembly: conversion of homometallic coordination networks into mixed metal-organic frameworks. |
Authors of publication | Béziau, Antoine; Baudron, Stéphane A; Rogez, Guillaume; Hosseini, Mir Wais |
Journal of publication | Inorganic chemistry |
Year of publication | 2015 |
Journal volume | 54 |
Journal issue | 4 |
Pages of publication | 2032 - 2039 |
a | 13.0316 ± 0.0011 Å |
b | 13.1577 ± 0.0011 Å |
c | 13.6126 ± 0.0011 Å |
α | 76.875 ± 0.004° |
β | 75.376 ± 0.004° |
γ | 63.567 ± 0.003° |
Cell volume | 2004.6 ± 0.3 Å3 |
Cell temperature | 173 ± 2 K |
Ambient diffraction temperature | 173 ± 2 K |
Number of distinct elements | 5 |
Space group number | 2 |
Hermann-Mauguin space group symbol | P -1 |
Hall space group symbol | -P 1 |
Residual factor for all reflections | 0.1669 |
Residual factor for significantly intense reflections | 0.0898 |
Weighted residual factors for significantly intense reflections | 0.211 |
Weighted residual factors for all reflections included in the refinement | 0.2578 |
Goodness-of-fit parameter for all reflections included in the refinement | 1.072 |
Diffraction radiation wavelength | 0.71073 Å |
Diffraction radiation type | MoKα |