Information card for entry 4342294
Chemical name | Lithium iron selenide hydroxide |
Formula | Fe1.1 H Li0.82 O Se |
Calculated formula | Fe1.096 H Li0.824 O Se |
Title of publication | Soft Chemical Control of Superconductivity in Lithium Iron Selenide Hydroxides Li1-xFex(OH)Fe1-ySe. |
Authors of publication | Sun, Hualei; Woodruff, Daniel N.; Cassidy, Simon J.; Allcroft, Genevieve M.; Sedlmaier, Stefan J.; Thompson, Amber L.; Bingham, Paul A.; Forder, Susan D.; Cartenet, Simon; Mary, Nicolas; Ramos, Silvia; Foronda, Francesca R.; Williams, Benjamin H.; Li, Xiaodong; Blundell, Stephen J.; Clarke, Simon J. |
Journal of publication | Inorganic chemistry |
Year of publication | 2015 |
Journal volume | 54 |
Journal issue | 4 |
Pages of publication | 1958 - 1964 |
a | 3.8249 ± 0.0001 Å |
b | 3.8249 ± 0.0001 Å |
c | 9.2378 ± 0.0007 Å |
α | 90° |
β | 90° |
γ | 90° |
Cell volume | 135.148 ± 0.011 Å3 |
Cell temperature | 100 K |
Ambient diffraction temperature | 100 K |
Number of distinct elements | 5 |
Space group number | 129 |
Hermann-Mauguin space group symbol | P 4/n m m :2 |
Hall space group symbol | -P 4a 2a |
Residual factor for all reflections | 0.0403 |
Residual factor for significantly intense reflections | 0.0302 |
Weighted residual factors for all reflections | 0.0758 |
Weighted residual factors for significantly intense reflections | 0.075 |
Weighted residual factors for all reflections included in the refinement | 0.0758 |
Goodness-of-fit parameter for all reflections included in the refinement | 0.9973 |
Diffraction radiation wavelength | 0.6889 Å |
Diffraction radiation type | Synchrotron |