Information card for entry 4342305
Formula | C51 H59 Ga Ge |
Calculated formula | C51 H59 Ga Ge |
Title of publication | Reaction of a germylene, stannylene, or plumbylene with trimethylaluminum and trimethylgallium: insertion into Al-C or ga-C bonds, a reversible metal-carbon insertion equilibrium, and a new route to diplumbenes. |
Authors of publication | Erickson, Jeremy D.; Fettinger, James C.; Power, Philip P. |
Journal of publication | Inorganic chemistry |
Year of publication | 2015 |
Journal volume | 54 |
Journal issue | 4 |
Pages of publication | 1940 - 1948 |
a | 10.0737 ± 0.0006 Å |
b | 42.017 ± 0.002 Å |
c | 10.6677 ± 0.0006 Å |
α | 90° |
β | 112.093 ± 0.001° |
γ | 90° |
Cell volume | 4183.7 ± 0.4 Å3 |
Cell temperature | 90 ± 2 K |
Ambient diffraction temperature | 90 ± 2 K |
Number of distinct elements | 4 |
Space group number | 14 |
Hermann-Mauguin space group symbol | P 1 21/c 1 |
Hall space group symbol | -P 2ybc |
Residual factor for all reflections | 0.0442 |
Residual factor for significantly intense reflections | 0.0313 |
Weighted residual factors for significantly intense reflections | 0.0669 |
Weighted residual factors for all reflections included in the refinement | 0.0718 |
Goodness-of-fit parameter for all reflections included in the refinement | 1.029 |
Diffraction radiation wavelength | 0.71073 Å |
Diffraction radiation type | MoKα |