Information card for entry 4342341
Formula | F30 Na3 Ti U6 |
Calculated formula | F30 Na3 Ti U6 |
Title of publication | Trivalent Cation-Controlled Phase Space of New U(IV) Fluorides, Na3MU6F30 (M = Al(3+), Ga(3+), Ti(3+), V(3+), Cr(3+), Fe(3+)): Mild Hydrothermal Synthesis Including an in Situ Reduction Step, Structures, Optical, and Magnetic Properties. |
Authors of publication | Yeon, Jeongho; Smith, Mark D.; Morrison, Gregory; Zur Loye, Hans-Conrad |
Journal of publication | Inorganic chemistry |
Year of publication | 2015 |
Journal volume | 54 |
Journal issue | 4 |
Pages of publication | 2058 - 2066 |
a | 9.8556 ± 0.0003 Å |
b | 9.8556 ± 0.0003 Å |
c | 12.9667 ± 0.0008 Å |
α | 90° |
β | 90° |
γ | 120° |
Cell volume | 1090.75 ± 0.08 Å3 |
Cell temperature | 100 ± 2 K |
Ambient diffraction temperature | 100 ± 2 K |
Number of distinct elements | 4 |
Space group number | 165 |
Hermann-Mauguin space group symbol | P -3 c 1 |
Hall space group symbol | -P 3 2"c |
Residual factor for all reflections | 0.0335 |
Residual factor for significantly intense reflections | 0.0302 |
Weighted residual factors for significantly intense reflections | 0.0703 |
Weighted residual factors for all reflections included in the refinement | 0.0716 |
Goodness-of-fit parameter for all reflections included in the refinement | 1.201 |
Diffraction radiation wavelength | 0.71073 Å |
Diffraction radiation type | MoKα |