Information card for entry 4342354
Formula | C4 H20 N20 O7 Zn |
Calculated formula | C4 H20 N20 O7 Zn |
SMILES | [Zn]12([OH2])(n3nnnc3Nc3nnnn13)n1nnnc1Nc1nnnn21.[NH3+]O.O[NH3+].O.O.O.O |
Title of publication | Nitrogen-Rich Salts Based on the Energetic [Monoaquabis(N,N-bis(1H-tetrazol-5-yl)amine)-zinc(II)] Anion: A Promising Design in the Development of New Energetic Materials. |
Authors of publication | Li, Fugang; Bi, Yangang; Zhao, Wenyuan; Zhang, Tonglai; Zhou, Zunning; Yang, Li |
Journal of publication | Inorganic chemistry |
Year of publication | 2015 |
Journal volume | 54 |
Journal issue | 4 |
Pages of publication | 2050 - 2057 |
a | 6.823 ± 0.0016 Å |
b | 12.498 ± 0.003 Å |
c | 13.2 ± 0.004 Å |
α | 116.252 ± 0.006° |
β | 98.777 ± 0.016° |
γ | 94.803 ± 0.012° |
Cell volume | 983.1 ± 0.5 Å3 |
Cell temperature | 153 ± 2 K |
Ambient diffraction temperature | 153 ± 2 K |
Number of distinct elements | 5 |
Space group number | 2 |
Hermann-Mauguin space group symbol | P -1 |
Hall space group symbol | -P 1 |
Residual factor for all reflections | 0.0394 |
Residual factor for significantly intense reflections | 0.0332 |
Weighted residual factors for significantly intense reflections | 0.0728 |
Weighted residual factors for all reflections included in the refinement | 0.0757 |
Goodness-of-fit parameter for all reflections included in the refinement | 1.048 |
Diffraction radiation wavelength | 0.71073 Å |
Diffraction radiation type | MoKα |