Information card for entry 4342357
Formula | C3 H11 N15 O0.5 Zn0.5 |
Calculated formula | C3 H11 N15 O0.5 Zn0.5 |
Title of publication | Nitrogen-Rich Salts Based on the Energetic [Monoaquabis(N,N-bis(1H-tetrazol-5-yl)amine)-zinc(II)] Anion: A Promising Design in the Development of New Energetic Materials. |
Authors of publication | Li, Fugang; Bi, Yangang; Zhao, Wenyuan; Zhang, Tonglai; Zhou, Zunning; Yang, Li |
Journal of publication | Inorganic chemistry |
Year of publication | 2015 |
Journal volume | 54 |
Journal issue | 4 |
Pages of publication | 2050 - 2057 |
a | 12.613 ± 0.003 Å |
b | 7.306 ± 0.0017 Å |
c | 13.188 ± 0.003 Å |
α | 90° |
β | 115.411 ± 0.002° |
γ | 90° |
Cell volume | 1097.7 ± 0.4 Å3 |
Cell temperature | 153 ± 2 K |
Ambient diffraction temperature | 153 ± 2 K |
Number of distinct elements | 5 |
Space group number | 13 |
Hermann-Mauguin space group symbol | P 1 2/c 1 |
Hall space group symbol | -P 2yc |
Residual factor for all reflections | 0.0428 |
Residual factor for significantly intense reflections | 0.0365 |
Weighted residual factors for significantly intense reflections | 0.0919 |
Weighted residual factors for all reflections included in the refinement | 0.0968 |
Goodness-of-fit parameter for all reflections included in the refinement | 1.002 |
Diffraction radiation wavelength | 0.71073 Å |
Diffraction radiation type | MoKα |