Information card for entry 4342362
Formula | C3 H7 Cd N O6 |
Calculated formula | C3 H7 Cd N O6 |
Title of publication | Room-Temperature Polar Order in [NH4][Cd(HCOO)3] - A Hybrid Inorganic-Organic Compound with a Unique Perovskite Architecture. |
Authors of publication | Gómez-Aguirre, L C; Pato-Doldán, B; Stroppa, A.; Yáñez-Vilar, S; Bayarjargal, L.; Winkler, B.; Castro-García, S; Mira, J.; Sánchez-Andújar, M; Señarís-Rodríguez, M A |
Journal of publication | Inorganic chemistry |
Year of publication | 2015 |
Journal volume | 54 |
Journal issue | 5 |
Pages of publication | 2109 |
a | 6.9888 ± 0.0002 Å |
b | 9.4902 ± 0.0002 Å |
c | 10.8342 ± 0.0003 Å |
α | 90° |
β | 90° |
γ | 90° |
Cell volume | 718.58 ± 0.03 Å3 |
Cell temperature | 293 ± 2 K |
Ambient diffraction temperature | 293 ± 2 K |
Number of distinct elements | 5 |
Space group number | 33 |
Hermann-Mauguin space group symbol | P n a 21 |
Hall space group symbol | P 2c -2n |
Residual factor for all reflections | 0.0174 |
Residual factor for significantly intense reflections | 0.0166 |
Weighted residual factors for significantly intense reflections | 0.0367 |
Weighted residual factors for all reflections included in the refinement | 0.0371 |
Goodness-of-fit parameter for all reflections included in the refinement | 1.088 |
Diffraction radiation wavelength | 0.71073 Å |
Diffraction radiation type | MoKα |