Information card for entry 4342364
Formula | C88 H128 Cl9 Cu9 N6 O4 P6 |
Calculated formula | C88 H128 Cl9 Cu9 N6 O4 P6 |
Title of publication | π-Rich σ(2)P-Heterocycles: Bent η(1)-P- and μ(2)-P-Coordinated 1,3-Benzazaphosphole Copper(I) Halide Complexes. |
Authors of publication | Ghalib, Mohammed; Jones, Peter G.; Schulzke, Carola; Sziebert, Dénes; Nyulászi, László; Heinicke, Joachim W. |
Journal of publication | Inorganic chemistry |
Year of publication | 2015 |
Journal volume | 54 |
Journal issue | 5 |
Pages of publication | 2117 |
a | 13.33 ± 0.003 Å |
b | 13.856 ± 0.003 Å |
c | 13.861 ± 0.003 Å |
α | 85.18 ± 0.03° |
β | 81.25 ± 0.03° |
γ | 82.12 ± 0.03° |
Cell volume | 2501.2 ± 1 Å3 |
Cell temperature | 170 ± 2 K |
Ambient diffraction temperature | 170 ± 2 K |
Number of distinct elements | 7 |
Space group number | 2 |
Hermann-Mauguin space group symbol | P -1 |
Hall space group symbol | -P 1 |
Residual factor for all reflections | 0.2505 |
Residual factor for significantly intense reflections | 0.0997 |
Weighted residual factors for significantly intense reflections | 0.17 |
Weighted residual factors for all reflections included in the refinement | 0.2157 |
Goodness-of-fit parameter for all reflections included in the refinement | 0.902 |
Diffraction radiation wavelength | 0.71073 Å |
Diffraction radiation type | MoKα |