Information card for entry 4342392
Formula | C19 H33 Cl F6 N5 P Zn |
Calculated formula | C19 H33 Cl F6 N5 P Zn |
SMILES | [Zn]1234(Cl)[n]5ccccc5C[N]51CCC[N]12CC[N]3(C)CCC[N]4(CC1)CC5.[P](F)(F)(F)(F)(F)[F-] |
Title of publication | Synthesis, Structural Studies, and Oxidation Catalysis of the Late-First-Row-Transition-Metal Complexes of a 2-Pyridylmethyl Pendant-Armed Ethylene Cross-Bridged Cyclam. |
Authors of publication | Jones, Donald G.; Wilson, Kevin R.; Cannon-Smith, Desiray J; Shircliff, Anthony D.; Zhang, Zhan; Chen, Zhuqi; Prior, Timothy J.; Yin, Guochuan; Hubin, Timothy J. |
Journal of publication | Inorganic chemistry |
Year of publication | 2015 |
Journal volume | 54 |
Journal issue | 5 |
Pages of publication | 2221 |
a | 22.794 ± 0.003 Å |
b | 13.7535 ± 0.0009 Å |
c | 15.1489 ± 0.0015 Å |
α | 90° |
β | 93.512 ± 0.009° |
γ | 90° |
Cell volume | 4740.2 ± 0.8 Å3 |
Cell temperature | 150 ± 2 K |
Ambient diffraction temperature | 150 ± 2 K |
Number of distinct elements | 7 |
Space group number | 14 |
Hermann-Mauguin space group symbol | P 1 21/c 1 |
Hall space group symbol | -P 2ybc |
Residual factor for all reflections | 0.0866 |
Residual factor for significantly intense reflections | 0.0504 |
Weighted residual factors for significantly intense reflections | 0.1084 |
Weighted residual factors for all reflections included in the refinement | 0.1185 |
Goodness-of-fit parameter for all reflections included in the refinement | 0.798 |
Diffraction radiation wavelength | 0.71073 Å |
Diffraction radiation type | MoKα |