Information card for entry 4342394
Formula | C32 H35 Fe2 Mo2 O9 P3 |
Calculated formula | C32 H35 Fe2 Mo2 O9 P3 |
SMILES | [Mo]123456([P](C7CCCCC7)(C7CCCCC7)[Mo]789%10%11([P]1(C)[Fe]([P]27[Fe](C#[O])(C#[O])(C#[O])C#[O])(C#[O])(C#[O])C#[O])(C#[O])[cH]1[cH]%10[cH]%11[cH]8[cH]91)(C#[O])[cH]1[cH]4[cH]5[cH]6[cH]31 |
Title of publication | Tetranuclear Phosphide- and Phosphinidene-Bridged Derivatives of the Diphosphenyl Complex [Mo2Cp2(μ-PCy2)(μ-κ(2):κ(2)-P2Me)(CO)2]. |
Authors of publication | Alvarez, M. Angeles; García, M Esther; Lozano, Raquel; Ramos, Alberto; Ruiz, Miguel A. |
Journal of publication | Inorganic chemistry |
Year of publication | 2015 |
Journal volume | 54 |
Journal issue | 5 |
Pages of publication | 2455 |
a | 10.575 ± 0.005 Å |
b | 11.884 ± 0.005 Å |
c | 15.513 ± 0.005 Å |
α | 74.117 ± 0.005° |
β | 74.843 ± 0.005° |
γ | 73.097 ± 0.005° |
Cell volume | 1758.7 ± 1.3 Å3 |
Cell temperature | 100 ± 0.1 K |
Ambient diffraction temperature | 100 ± 0.1 K |
Number of distinct elements | 6 |
Space group number | 2 |
Hermann-Mauguin space group symbol | P -1 |
Hall space group symbol | -P 1 |
Residual factor for all reflections | 0.0587 |
Residual factor for significantly intense reflections | 0.0412 |
Weighted residual factors for significantly intense reflections | 0.0604 |
Weighted residual factors for all reflections included in the refinement | 0.067 |
Goodness-of-fit parameter for all reflections included in the refinement | 1.069 |
Diffraction radiation probe | x-ray |
Diffraction radiation wavelength | 0.71073 Å |
Diffraction radiation type | MoKα |