Information card for entry 4342396
Formula | C73 H78 Mo4 O20 P6 W4 |
Calculated formula | C73 H78 Mo4 O20 P6 W4 |
Title of publication | Tetranuclear Phosphide- and Phosphinidene-Bridged Derivatives of the Diphosphenyl Complex [Mo2Cp2(μ-PCy2)(μ-κ(2):κ(2)-P2Me)(CO)2]. |
Authors of publication | Alvarez, M. Angeles; García, M Esther; Lozano, Raquel; Ramos, Alberto; Ruiz, Miguel A. |
Journal of publication | Inorganic chemistry |
Year of publication | 2015 |
Journal volume | 54 |
Journal issue | 5 |
Pages of publication | 2455 |
a | 19.956 ± 0.003 Å |
b | 10.6471 ± 0.0011 Å |
c | 21.872 ± 0.003 Å |
α | 90° |
β | 117.684 ± 0.01° |
γ | 90° |
Cell volume | 4115.2 ± 1 Å3 |
Cell temperature | 100 ± 0.1 K |
Ambient diffraction temperature | 100 ± 0.1 K |
Number of distinct elements | 6 |
Space group number | 14 |
Hermann-Mauguin space group symbol | P 1 21/c 1 |
Hall space group symbol | -P 2ybc |
Residual factor for all reflections | 0.017 |
Residual factor for significantly intense reflections | 0.0147 |
Weighted residual factors for significantly intense reflections | 0.0304 |
Weighted residual factors for all reflections included in the refinement | 0.031 |
Goodness-of-fit parameter for all reflections included in the refinement | 1.037 |
Diffraction radiation probe | x-ray |
Diffraction radiation wavelength | 0.71073 Å |
Diffraction radiation type | MoKα |