Information card for entry 4342413
Formula | C64 H50 Cu4 N10 O20 S2 |
Calculated formula | C64 H50 Cu4 N8 O20 S2 |
Title of publication | Aerobic Oxidation of Alcohols and the Synthesis of Benzoxazoles Catalyzed by a Cuprocupric Coordination Polymer (Cu(+)-CP) Assisted by TEMPO. |
Authors of publication | Feng, Xun; Xu, Chen; Wang, Zhi-Qiang; Tang, Si-Fu; Fu, Wei-Jun; Ji, Bao-Ming; Wang, Li-Ya |
Journal of publication | Inorganic chemistry |
Year of publication | 2015 |
Journal volume | 54 |
Journal issue | 5 |
Pages of publication | 2088 |
a | 10.8222 ± 0.0011 Å |
b | 11.0221 ± 0.0011 Å |
c | 12.8735 ± 0.0012 Å |
α | 88.851 ± 0.002° |
β | 77.519 ± 0.002° |
γ | 84.557 ± 0.002° |
Cell volume | 1492.5 ± 0.3 Å3 |
Cell temperature | 296 ± 2 K |
Ambient diffraction temperature | 296 ± 2 K |
Number of distinct elements | 6 |
Space group number | 2 |
Hermann-Mauguin space group symbol | P -1 |
Hall space group symbol | -P 1 |
Residual factor for all reflections | 0.0881 |
Residual factor for significantly intense reflections | 0.0504 |
Weighted residual factors for significantly intense reflections | 0.1205 |
Weighted residual factors for all reflections included in the refinement | 0.1365 |
Goodness-of-fit parameter for all reflections included in the refinement | 1.037 |
Diffraction radiation wavelength | 0.71073 Å |
Diffraction radiation type | MoKα |