Information card for entry 4342415
Formula | Ni O6 Pb Se2 |
Calculated formula | Ni O6 Pb Se2 |
Title of publication | pH Controlled Pathway and Systematic Hydrothermal Phase Diagram for Elaboration of Synthetic Lead Nickel Selenites. |
Authors of publication | Kovrugin, Vadim M.; Colmont, Marie; Terryn, Christine; Colis, Silviu; Siidra, Oleg I.; Krivovichev, Sergey V.; Mentré, Olivier |
Journal of publication | Inorganic chemistry |
Year of publication | 2015 |
Journal volume | 54 |
Journal issue | 5 |
Pages of publication | 2425 |
a | 12.7476 ± 0.0004 Å |
b | 5.4562 ± 0.0002 Å |
c | 7.8332 ± 0.0002 Å |
α | 90° |
β | 90° |
γ | 90° |
Cell volume | 544.83 ± 0.03 Å3 |
Cell temperature | 293 ± 2 K |
Ambient diffraction temperature | 293 ± 2 K |
Number of distinct elements | 4 |
Space group number | 62 |
Hermann-Mauguin space group symbol | P n m a |
Hall space group symbol | -P 2ac 2n |
Residual factor for all reflections | 0.0165 |
Residual factor for significantly intense reflections | 0.0139 |
Weighted residual factors for significantly intense reflections | 0.036 |
Weighted residual factors for all reflections included in the refinement | 0.0387 |
Goodness-of-fit parameter for all reflections included in the refinement | 1.09 |
Diffraction radiation wavelength | 0.71073 Å |
Diffraction radiation type | MoKα |