Information card for entry 4342422
Formula | C29 H23 Ir N2 S2 |
Calculated formula | C29 H23 Ir N2 S2 |
SMILES | [Ir]123([S](c4c(S1)cccc4)C)([n]1c(c4c2cccc4)cccc1)[n]1c(c2c3cccc2)cccc1 |
Title of publication | Ir(2-Phenylpyridine)2(benzene-1,2-dithiolate) Anion as a Diastereoselective Metalloligand and Nucleophile: Stereoelectronic Effect, Spectroscopy, and Computational Study of the Methylated and Aurated Complexes and their Oxygenation Products. |
Authors of publication | Nguyen, Van Ha; Khoo, Rebecca Shu Hui; Yip, John H. K. |
Journal of publication | Inorganic chemistry |
Year of publication | 2015 |
Journal volume | 54 |
Journal issue | 5 |
Pages of publication | 2264 |
a | 9.2232 ± 0.0005 Å |
b | 11.7387 ± 0.0006 Å |
c | 22.4883 ± 0.0013 Å |
α | 90° |
β | 90° |
γ | 90° |
Cell volume | 2434.8 ± 0.2 Å3 |
Cell temperature | 100 ± 2 K |
Ambient diffraction temperature | 100 ± 2 K |
Number of distinct elements | 5 |
Space group number | 19 |
Hermann-Mauguin space group symbol | P 21 21 21 |
Hall space group symbol | P 2ac 2ab |
Residual factor for all reflections | 0.0258 |
Residual factor for significantly intense reflections | 0.0201 |
Weighted residual factors for significantly intense reflections | 0.0369 |
Weighted residual factors for all reflections included in the refinement | 0.0381 |
Goodness-of-fit parameter for all reflections included in the refinement | 1.027 |
Diffraction radiation wavelength | 0.71073 Å |
Diffraction radiation type | MoKα |