Information card for entry 4342425
Formula | C59 H65 B F24 N2 O4 P2 Ru |
Calculated formula | C59 H65 B F24 N2 O4 P2 Ru |
Title of publication | New Ruthenium Nitrosyl Pincer Complexes Bearing an O2 Ligand. Mono-Oxygen Transfer. |
Authors of publication | Fogler, Eran; Efremenko, Irena; Gargir, Moti; Leitus, Gregory; Diskin-Posner, Yael; Ben-David, Yehoshoa; Martin, Jan M. L.; Milstein, David |
Journal of publication | Inorganic chemistry |
Year of publication | 2015 |
Journal volume | 54 |
Journal issue | 5 |
Pages of publication | 2253 |
a | 13.349 ± 0.003 Å |
b | 24.04 ± 0.005 Å |
c | 20.339 ± 0.004 Å |
α | 90° |
β | 97.69 ± 0.03° |
γ | 90° |
Cell volume | 6468 ± 2 Å3 |
Cell temperature | 100 ± 2 K |
Ambient diffraction temperature | 100 ± 2 K |
Number of distinct elements | 8 |
Space group number | 14 |
Hermann-Mauguin space group symbol | P 1 21/c 1 |
Hall space group symbol | -P 2ybc |
Residual factor for all reflections | 0.0936 |
Residual factor for significantly intense reflections | 0.0646 |
Weighted residual factors for significantly intense reflections | 0.1714 |
Weighted residual factors for all reflections included in the refinement | 0.1921 |
Goodness-of-fit parameter for all reflections included in the refinement | 1.058 |
Diffraction radiation wavelength | 0.71073 Å |
Diffraction radiation type | MoKα |