Information card for entry 4342427
Formula | C624 H1056 N48 O48 P48 Ru24 |
Calculated formula | C624 H1056 N48 O48 P48 Ru24 |
Title of publication | New Ruthenium Nitrosyl Pincer Complexes Bearing an O2 Ligand. Mono-Oxygen Transfer. |
Authors of publication | Fogler, Eran; Efremenko, Irena; Gargir, Moti; Leitus, Gregory; Diskin-Posner, Yael; Ben-David, Yehoshoa; Martin, Jan M. L.; Milstein, David |
Journal of publication | Inorganic chemistry |
Year of publication | 2015 |
Journal volume | 54 |
Journal issue | 5 |
Pages of publication | 2253 |
a | 25.6471 ± 0.001 Å |
b | 25.6471 ± 0.001 Å |
c | 25.6471 ± 0.001 Å |
α | 90° |
β | 90° |
γ | 90° |
Cell volume | 16870 ± 1.1 Å3 |
Cell temperature | 100 ± 2 K |
Ambient diffraction temperature | 100 ± 2 K |
Number of distinct elements | 6 |
Space group number | 205 |
Hermann-Mauguin space group symbol | P a -3 |
Hall space group symbol | -P 2ac 2ab 3 |
Residual factor for all reflections | 0.045 |
Residual factor for significantly intense reflections | 0.0294 |
Weighted residual factors for significantly intense reflections | 0.0659 |
Weighted residual factors for all reflections included in the refinement | 0.0766 |
Goodness-of-fit parameter for all reflections included in the refinement | 1.174 |
Diffraction radiation wavelength | 0.71073 Å |
Diffraction radiation type | MoKα |