Information card for entry 4342430
Formula | C24 H27 P Te |
Calculated formula | C24 H27 P Te |
SMILES | [Te](c1ccc2c3c(ccc(P(C(C)C)C(C)C)c13)CC2)c1ccccc1 |
Title of publication | Peri-Substituted Phosphorus-Tellurium Systems-An Experimental and Theoretical Investigation of the P···Te through-Space Interaction. |
Authors of publication | Nordheider, Andreas; Hupf, Emanuel; Chalmers, Brian A.; Knight, Fergus R.; Bühl, Michael; Mebs, Stefan; Chęcińska, Lilianna; Lork, Enno; Camacho, Paula Sanz; Ashbrook, Sharon E.; Athukorala Arachchige, Kasun S.; Cordes, David B.; Slawin, Alexandra M. Z.; Beckmann, Jens; Woollins, J. Derek |
Journal of publication | Inorganic chemistry |
Year of publication | 2015 |
Journal volume | 54 |
Journal issue | 5 |
Pages of publication | 2435 |
a | 8.6463 ± 0.0008 Å |
b | 10.5753 ± 0.0011 Å |
c | 11.8312 ± 0.001 Å |
α | 87.512 ± 0.005° |
β | 78.942 ± 0.005° |
γ | 81.061 ± 0.004° |
Cell volume | 1048.73 ± 0.17 Å3 |
Cell temperature | 173 K |
Ambient diffraction temperature | 173 K |
Number of distinct elements | 4 |
Space group number | 2 |
Hermann-Mauguin space group symbol | P -1 |
Hall space group symbol | -P 1 |
Residual factor for significantly intense reflections | 0.0209 |
Weighted residual factors for all reflections included in the refinement | 0.0454 |
Goodness-of-fit parameter for all reflections included in the refinement | 0.971 |
Diffraction radiation wavelength | 0.71075 Å |
Diffraction radiation type | MoKα |