Information card for entry 4342454
Chemical name | Λ-Bis{(S)-N-(1-(4-bromophenyl)ethyl)salicylaldiminato- κ^2^N,O}copper(II) |
Formula | C60 H52 Br4 Cu2 N4 O4 |
Calculated formula | C60 H52 Br4 Cu2 N4 O4 |
Title of publication | Solvation-Induced Helicity Inversion of Pseudotetrahedral Chiral Copper(II) Complexes. |
Authors of publication | Chamayou, Anne-Christine; Makhloufi, Gamall; Nafie, Laurence A.; Janiak, Christoph; Lüdeke, Steffen |
Journal of publication | Inorganic chemistry |
Year of publication | 2015 |
Journal volume | 54 |
Journal issue | 5 |
Pages of publication | 2193 |
a | 25.442 ± 0.003 Å |
b | 11.4723 ± 0.0012 Å |
c | 9.9846 ± 0.001 Å |
α | 90° |
β | 111.797 ± 0.002° |
γ | 90° |
Cell volume | 2705.9 ± 0.5 Å3 |
Cell temperature | 100 ± 2 K |
Ambient diffraction temperature | 100 ± 2 K |
Number of distinct elements | 6 |
Space group number | 5 |
Hermann-Mauguin space group symbol | C 1 2 1 |
Hall space group symbol | C 2y |
Residual factor for all reflections | 0.0336 |
Residual factor for significantly intense reflections | 0.0298 |
Weighted residual factors for significantly intense reflections | 0.0705 |
Weighted residual factors for all reflections included in the refinement | 0.0718 |
Goodness-of-fit parameter for all reflections included in the refinement | 1.026 |
Diffraction radiation wavelength | 0.71073 Å |
Diffraction radiation type | MoKα |