Information card for entry 4342465
Formula | Ba3 Fe Se6 U |
Calculated formula | Ba3 Fe Se6 U |
Title of publication | Positional Flexibility: Syntheses and Characterization of Six Uranium Chalcogenides Related to the 2H Hexagonal Perovskite Family. |
Authors of publication | Mesbah, Adel; Prakash, Jai; Beard, Jessica C.; Pozzi, Eric A.; Tarasenko, Mariya S.; Lebègue, Sébastien; Malliakas, Christos D.; Van Duyne, Richard P.; Ibers, James A. |
Journal of publication | Inorganic chemistry |
Year of publication | 2015 |
Journal volume | 54 |
Journal issue | 6 |
Pages of publication | 2851 - 2857 |
a | 12.4842 ± 0.001 Å |
b | 12.4842 ± 0.001 Å |
c | 13.9258 ± 0.0011 Å |
α | 90° |
β | 90° |
γ | 120° |
Cell volume | 1879.6 ± 0.3 Å3 |
Cell temperature | 100 ± 2 K |
Ambient diffraction temperature | 100 ± 2 K |
Number of distinct elements | 4 |
Space group number | 167 |
Hermann-Mauguin space group symbol | R -3 c :H |
Hall space group symbol | -R 3 2"c |
Residual factor for all reflections | 0.0161 |
Residual factor for significantly intense reflections | 0.0144 |
Weighted residual factors for significantly intense reflections | 0.0276 |
Weighted residual factors for all reflections included in the refinement | 0.0281 |
Goodness-of-fit parameter for all reflections included in the refinement | 1.163 |
Diffraction radiation wavelength | 0.71073 Å |
Diffraction radiation type | MoKα |