Information card for entry 4342476
Common name | Cr(CO)5(CN(pF-ArDArF)) |
Formula | C28 H8 Cr F13 N O5 |
Calculated formula | C28 H8 Cr F13 N O5 |
SMILES | [Cr](C#[O])(C#[O])(C#[O])(C#[O])(C#[O])C#[N]c1c(cc(F)cc1c1cc(C(F)(F)F)cc(C(F)(F)F)c1)c1cc(C(F)(F)F)cc(C(F)(F)F)c1 |
Title of publication | Comparative measure of the electronic influence of highly substituted aryl isocyanides. |
Authors of publication | Carpenter, Alex E.; Mokhtarzadeh, Charles C.; Ripatti, Donald S.; Havrylyuk, Irena; Kamezawa, Ryo; Moore, Curtis E.; Rheingold, Arnold L.; Figueroa, Joshua S. |
Journal of publication | Inorganic chemistry |
Year of publication | 2015 |
Journal volume | 54 |
Journal issue | 6 |
Pages of publication | 2936 - 2944 |
a | 13.9002 ± 0.0005 Å |
b | 13.9199 ± 0.0006 Å |
c | 14.575 ± 0.0005 Å |
α | 90° |
β | 93.492 ± 0.0011° |
γ | 90° |
Cell volume | 2814.87 ± 0.19 Å3 |
Cell temperature | 100 K |
Ambient diffraction temperature | 100 K |
Number of distinct elements | 6 |
Space group number | 14 |
Hermann-Mauguin space group symbol | P 1 21/n 1 |
Hall space group symbol | -P 2yn |
Residual factor for all reflections | 0.0425 |
Residual factor for significantly intense reflections | 0.0322 |
Weighted residual factors for significantly intense reflections | 0.078 |
Weighted residual factors for all reflections included in the refinement | 0.0835 |
Goodness-of-fit parameter for all reflections included in the refinement | 1.021 |
Diffraction radiation probe | x-ray |
Diffraction radiation wavelength | 0.71073 Å |
Diffraction radiation type | MoKα |