Information card for entry 4342479
Common name | Cr(CO)5(CN(pMeArDArF2)) |
Formula | C29 H11 Cr F12 N O5 |
Calculated formula | C29 H11 Cr F12 N O5 |
Title of publication | Comparative measure of the electronic influence of highly substituted aryl isocyanides. |
Authors of publication | Carpenter, Alex E.; Mokhtarzadeh, Charles C.; Ripatti, Donald S.; Havrylyuk, Irena; Kamezawa, Ryo; Moore, Curtis E.; Rheingold, Arnold L.; Figueroa, Joshua S. |
Journal of publication | Inorganic chemistry |
Year of publication | 2015 |
Journal volume | 54 |
Journal issue | 6 |
Pages of publication | 2936 - 2944 |
a | 11.3248 ± 0.0003 Å |
b | 12.6913 ± 0.0004 Å |
c | 20.7094 ± 0.0007 Å |
α | 90° |
β | 91.4627 ± 0.0009° |
γ | 90° |
Cell volume | 2975.52 ± 0.16 Å3 |
Cell temperature | 100 K |
Ambient diffraction temperature | 100 K |
Number of distinct elements | 6 |
Space group number | 14 |
Hermann-Mauguin space group symbol | P 1 21/c 1 |
Hall space group symbol | -P 2ybc |
Residual factor for all reflections | 0.0538 |
Residual factor for significantly intense reflections | 0.0457 |
Weighted residual factors for significantly intense reflections | 0.1132 |
Weighted residual factors for all reflections included in the refinement | 0.1193 |
Goodness-of-fit parameter for all reflections included in the refinement | 1.042 |
Diffraction radiation probe | x-ray |
Diffraction radiation wavelength | 0.71073 Å |
Diffraction radiation type | MoKα |