Information card for entry 4342485
Formula | C37.86 H40 N8 Ni2 S4 |
Calculated formula | C37.855 H40 N8 Ni2 S4 |
Title of publication | Size-Controlled Synthesis of Ag Nanoparticles Functionalized by Heteroleptic Dipyrrinato Complexes Having meso-Pyridyl Substituents and Their Catalytic Applications. |
Authors of publication | Gupta, Rakesh Kumar; Dubey, Mrigendra; Li, Pei Zhou; Xu, Qiang; Pandey, Daya Shankar |
Journal of publication | Inorganic chemistry |
Year of publication | 2015 |
Journal volume | 54 |
Journal issue | 6 |
Pages of publication | 2500 - 2511 |
a | 14.349 ± 0.003 Å |
b | 15.726 ± 0.003 Å |
c | 18.35 ± 0.004 Å |
α | 90° |
β | 108.45 ± 0.03° |
γ | 90° |
Cell volume | 3927.9 ± 1.6 Å3 |
Cell temperature | 293 ± 2 K |
Ambient diffraction temperature | 293 ± 2 K |
Number of distinct elements | 5 |
Space group number | 14 |
Hermann-Mauguin space group symbol | P 1 21/c 1 |
Hall space group symbol | -P 2ybc |
Residual factor for all reflections | 0.0717 |
Residual factor for significantly intense reflections | 0.0524 |
Weighted residual factors for significantly intense reflections | 0.1541 |
Weighted residual factors for all reflections included in the refinement | 0.1648 |
Goodness-of-fit parameter for all reflections included in the refinement | 1.103 |
Diffraction radiation wavelength | 0.71073 Å |
Diffraction radiation type | MoKα |