Information card for entry 4342489
Common name | M4L6OH |
Formula | C360 H384 Cl16 Co8 N72 O124 |
Calculated formula | C360 H311 Cl14 Co8 N72 O116 |
Title of publication | An Interconverting Family of Coordination Cages and a meso-Helicate; Effects of Temperature, Concentration, and Solvent on the Product Distribution of a Self-Assembly Process. |
Authors of publication | Cullen, William; Hunter, Christopher A.; Ward, Michael D. |
Journal of publication | Inorganic chemistry |
Year of publication | 2015 |
Journal volume | 54 |
Journal issue | 6 |
Pages of publication | 2626 - 2637 |
a | 19.2188 ± 0.0013 Å |
b | 29.07 ± 0.002 Å |
c | 35.46 ± 0.003 Å |
α | 90.322 ± 0.003° |
β | 98.971 ± 0.003° |
γ | 98.598 ± 0.003° |
Cell volume | 19340 ± 2 Å3 |
Cell temperature | 100 ± 2 K |
Ambient diffraction temperature | 100 ± 2 K |
Number of distinct elements | 6 |
Space group number | 2 |
Hermann-Mauguin space group symbol | P -1 |
Hall space group symbol | -P 1 |
Residual factor for all reflections | 0.1728 |
Residual factor for significantly intense reflections | 0.1275 |
Weighted residual factors for significantly intense reflections | 0.3647 |
Weighted residual factors for all reflections included in the refinement | 0.4057 |
Goodness-of-fit parameter for all reflections included in the refinement | 1.529 |
Diffraction radiation wavelength | 0.71073 Å |
Diffraction radiation type | MoKα |