Information card for entry 4342499
Chemical name | Bismuth Chromium Selenide |
Formula | Bi1.5 Cr1.25 Se4 |
Calculated formula | Bi1.5 Cr1.25 Se4 |
Title of publication | (BiSe)1.23CrSe2 and (BiSe)1.22(Cr1.2Se2)2: Magnetic Anisotropy in the First Structurally Characterized Bi-Se-Cr Ternary Compounds. |
Authors of publication | Clarke, Samantha M.; Freedman, Danna E. |
Journal of publication | Inorganic chemistry |
Year of publication | 2015 |
Journal volume | 54 |
Journal issue | 6 |
Pages of publication | 2765 - 2771 |
a | 6.1706 ± 0.0019 Å |
b | 17.748 ± 0.005 Å |
c | 11.474 ± 0.004 Å |
α | 90° |
β | 95.04 ± 0.03° |
γ | 90° |
Cell volume | 1251.7 ± 0.7 Å3 |
Cell temperature | 250 ± 2 K |
Ambient diffraction temperature | 250 K |
Number of distinct elements | 3 |
Space group number | 8 |
Hermann-Mauguin space group symbol | C 1 m 1 |
Hall space group symbol | C -2y |
Residual factor for all reflections | 0.3256 |
Residual factor for significantly intense reflections | 0.1362 |
Weighted residual factors for significantly intense reflections | 0.3102 |
Weighted residual factors for all reflections included in the refinement | 0.4516 |
Goodness-of-fit parameter for all reflections included in the refinement | 0.958 |
Diffraction radiation probe | x-ray |
Diffraction radiation wavelength | 0.71073 Å |
Diffraction radiation type | MoKα |