Information card for entry 4342516
Formula | C14.5 H19.75 N1.25 O7 U |
Calculated formula | C14.5 H19.75 N1.25 O7 U |
Title of publication | Uranyl and uranyl-3d block cation complexes with 1,3-adamantanedicarboxylate: crystal structures, luminescence, and magnetic properties. |
Authors of publication | Thuéry, Pierre; Rivière, Eric; Harrowfield, Jack |
Journal of publication | Inorganic chemistry |
Year of publication | 2015 |
Journal volume | 54 |
Journal issue | 6 |
Pages of publication | 2838 - 2850 |
a | 11.0329 ± 0.0003 Å |
b | 16.7685 ± 0.0005 Å |
c | 19.2896 ± 0.0003 Å |
α | 90° |
β | 94.4887 ± 0.0018° |
γ | 90° |
Cell volume | 3557.73 ± 0.15 Å3 |
Cell temperature | 150 ± 2 K |
Ambient diffraction temperature | 150 ± 2 K |
Number of distinct elements | 5 |
Space group number | 14 |
Hermann-Mauguin space group symbol | P 1 21/n 1 |
Hall space group symbol | -P 2yn |
Residual factor for all reflections | 0.0328 |
Residual factor for significantly intense reflections | 0.0248 |
Weighted residual factors for significantly intense reflections | 0.0574 |
Weighted residual factors for all reflections included in the refinement | 0.0593 |
Goodness-of-fit parameter for all reflections included in the refinement | 1.039 |
Diffraction radiation wavelength | 0.71073 Å |
Diffraction radiation type | MoKα |