Information card for entry 4342524
Formula | C56 H59 Cu2 N6 O22.5 U2 |
Calculated formula | C56 H58 Cu2 N6 O22.5 U2 |
Title of publication | Uranyl and uranyl-3d block cation complexes with 1,3-adamantanedicarboxylate: crystal structures, luminescence, and magnetic properties. |
Authors of publication | Thuéry, Pierre; Rivière, Eric; Harrowfield, Jack |
Journal of publication | Inorganic chemistry |
Year of publication | 2015 |
Journal volume | 54 |
Journal issue | 6 |
Pages of publication | 2838 - 2850 |
a | 13.7842 ± 0.0007 Å |
b | 14.043 ± 0.0005 Å |
c | 16.2606 ± 0.0007 Å |
α | 89.053 ± 0.003° |
β | 82.825 ± 0.002° |
γ | 80.931 ± 0.003° |
Cell volume | 3083.9 ± 0.2 Å3 |
Cell temperature | 150 ± 2 K |
Ambient diffraction temperature | 150 ± 2 K |
Number of distinct elements | 6 |
Space group number | 2 |
Hermann-Mauguin space group symbol | P -1 |
Hall space group symbol | -P 1 |
Residual factor for all reflections | 0.0583 |
Residual factor for significantly intense reflections | 0.0504 |
Weighted residual factors for significantly intense reflections | 0.1297 |
Weighted residual factors for all reflections included in the refinement | 0.1326 |
Goodness-of-fit parameter for all reflections included in the refinement | 1.106 |
Diffraction radiation wavelength | 0.71073 Å |
Diffraction radiation type | MoKα |