Information card for entry 4342532
Formula | C84 H44 Co2 Mn5 N12 O68 |
Calculated formula | C84 H44 Co2 Mn5 N12 O68 |
Title of publication | Manganese- and cobalt-based coordination networks as promising heterogeneous catalysts for olefin epoxidation reactions. |
Authors of publication | Kumar, Girijesh; Kumar, Gulshan; Gupta, Rajeev |
Journal of publication | Inorganic chemistry |
Year of publication | 2015 |
Journal volume | 54 |
Journal issue | 6 |
Pages of publication | 2603 - 2615 |
a | 13.6848 ± 0.0007 Å |
b | 14.5766 ± 0.0008 Å |
c | 15.3761 ± 0.0008 Å |
α | 98.393 ± 0.004° |
β | 91.034 ± 0.004° |
γ | 98.274 ± 0.004° |
Cell volume | 3000.4 ± 0.3 Å3 |
Cell temperature | 298 ± 2 K |
Ambient diffraction temperature | 298 ± 2 K |
Number of distinct elements | 6 |
Space group number | 2 |
Hermann-Mauguin space group symbol | P -1 |
Hall space group symbol | -P 1 |
Residual factor for all reflections | 0.1154 |
Residual factor for significantly intense reflections | 0.0898 |
Weighted residual factors for significantly intense reflections | 0.2183 |
Weighted residual factors for all reflections included in the refinement | 0.2389 |
Goodness-of-fit parameter for all reflections included in the refinement | 1.028 |
Diffraction radiation wavelength | 0.71073 Å |
Diffraction radiation type | MoKα |