Information card for entry 4342558
Formula | C16 H18 Mn N2 O11 |
Calculated formula | C16 H18 Mn N2 O11 |
Title of publication | Four New Mn(II) Inorganic-Organic Hybrid Frameworks with Diverse Inorganic Magnetic Chain's Sequences: Syntheses, Structures, Magnetic, NLO, and Dielectric Properties. |
Authors of publication | Tian, Chong-Bin; He, Chao; Han, Yun-Hu; Wei, Qi; Li, Qi-Peng; Lin, Ping; Du, Shao-Wu |
Journal of publication | Inorganic chemistry |
Year of publication | 2015 |
Journal volume | 54 |
Journal issue | 6 |
Pages of publication | 2560 - 2571 |
a | 28.045 ± 0.019 Å |
b | 4.536 ± 0.003 Å |
c | 15.597 ± 0.011 Å |
α | 90° |
β | 116.2 ± 0.007° |
γ | 90° |
Cell volume | 1780 ± 2 Å3 |
Cell temperature | 293 ± 2 K |
Ambient diffraction temperature | 293 ± 2 K |
Number of distinct elements | 5 |
Space group number | 15 |
Hermann-Mauguin space group symbol | C 1 2/c 1 |
Hall space group symbol | -C 2yc |
Residual factor for all reflections | 0.06 |
Residual factor for significantly intense reflections | 0.055 |
Weighted residual factors for significantly intense reflections | 0.1557 |
Weighted residual factors for all reflections included in the refinement | 0.161 |
Goodness-of-fit parameter for all reflections included in the refinement | 1.012 |
Diffraction radiation wavelength | 0.71073 Å |
Diffraction radiation type | MoKα |