Information card for entry 4342562
Formula | C72 H47 Mn4 N O31 S5 |
Calculated formula | C72 H49 Mn4 N O31 S5 |
Title of publication | Four New Mn(II) Inorganic-Organic Hybrid Frameworks with Diverse Inorganic Magnetic Chain's Sequences: Syntheses, Structures, Magnetic, NLO, and Dielectric Properties. |
Authors of publication | Tian, Chong-Bin; He, Chao; Han, Yun-Hu; Wei, Qi; Li, Qi-Peng; Lin, Ping; Du, Shao-Wu |
Journal of publication | Inorganic chemistry |
Year of publication | 2015 |
Journal volume | 54 |
Journal issue | 6 |
Pages of publication | 2560 - 2571 |
a | 23.604 ± 0.008 Å |
b | 41.954 ± 0.012 Å |
c | 11.675 ± 0.004 Å |
α | 90° |
β | 116.908 ± 0.004° |
γ | 90° |
Cell volume | 10310 ± 6 Å3 |
Cell temperature | 293 ± 2 K |
Ambient diffraction temperature | 293 ± 2 K |
Number of distinct elements | 6 |
Space group number | 9 |
Hermann-Mauguin space group symbol | C 1 c 1 |
Hall space group symbol | C -2yc |
Residual factor for all reflections | 0.084 |
Residual factor for significantly intense reflections | 0.0612 |
Weighted residual factors for significantly intense reflections | 0.1635 |
Weighted residual factors for all reflections included in the refinement | 0.1873 |
Goodness-of-fit parameter for all reflections included in the refinement | 1.038 |
Diffraction radiation wavelength | 0.71073 Å |
Diffraction radiation type | MoKα |