Information card for entry 4342564
Formula | C23 H23 F3 Mo N4 O5 S |
Calculated formula | C23 H23 F3 Mo N4 O5 S |
Title of publication | Influence of the N-N Coligand: C-C Coupling Instead of Formation of Imidazol-2-yl Complexes at {Mo(η(3)-allyl)(CO)2} Fragments. Theoretical and Experimental Studies. |
Authors of publication | Cebollada, Andrea; Viguri, Maialen Espinal; Pérez, Julio; Díaz, Jesús; López, Ramón; Riera, Lucía |
Journal of publication | Inorganic chemistry |
Year of publication | 2015 |
Journal volume | 54 |
Journal issue | 6 |
Pages of publication | 2580 - 2590 |
a | 8.5194 ± 0.0003 Å |
b | 11.1863 ± 0.0003 Å |
c | 30.02 ± 0.001 Å |
α | 90° |
β | 93.456 ± 0.002° |
γ | 90° |
Cell volume | 2855.72 ± 0.16 Å3 |
Cell temperature | 100 ± 0.1 K |
Ambient diffraction temperature | 100 ± 0.1 K |
Number of distinct elements | 7 |
Space group number | 14 |
Hermann-Mauguin space group symbol | P 1 21/c 1 |
Hall space group symbol | -P 2ybc |
Residual factor for all reflections | 0.072 |
Residual factor for significantly intense reflections | 0.0511 |
Weighted residual factors for significantly intense reflections | 0.1228 |
Weighted residual factors for all reflections included in the refinement | 0.1306 |
Goodness-of-fit parameter for all reflections included in the refinement | 1.049 |
Diffraction radiation wavelength | 0.71073 Å |
Diffraction radiation type | MoKα |