Information card for entry 4342566
Formula | C23 H32 F3 Mo N4 O5 S |
Calculated formula | C23 H32 F3 Mo N4 O5 S |
Title of publication | Influence of the N-N Coligand: C-C Coupling Instead of Formation of Imidazol-2-yl Complexes at {Mo(η(3)-allyl)(CO)2} Fragments. Theoretical and Experimental Studies. |
Authors of publication | Cebollada, Andrea; Viguri, Maialen Espinal; Pérez, Julio; Díaz, Jesús; López, Ramón; Riera, Lucía |
Journal of publication | Inorganic chemistry |
Year of publication | 2015 |
Journal volume | 54 |
Journal issue | 6 |
Pages of publication | 2580 - 2590 |
a | 7.945 ± 0.005 Å |
b | 9.96 ± 0.005 Å |
c | 18.139 ± 0.005 Å |
α | 74.699 ± 0.005° |
β | 80.275 ± 0.005° |
γ | 83.379 ± 0.005° |
Cell volume | 1360.8 ± 1.2 Å3 |
Cell temperature | 100 ± 0.1 K |
Ambient diffraction temperature | 100 ± 0.1 K |
Number of distinct elements | 7 |
Space group number | 2 |
Hermann-Mauguin space group symbol | P -1 |
Hall space group symbol | -P 1 |
Residual factor for all reflections | 0.1154 |
Residual factor for significantly intense reflections | 0.0829 |
Weighted residual factors for significantly intense reflections | 0.1997 |
Weighted residual factors for all reflections included in the refinement | 0.2271 |
Goodness-of-fit parameter for all reflections included in the refinement | 1.121 |
Diffraction radiation wavelength | 0.71073 Å |
Diffraction radiation type | MoKα |