Information card for entry 4342573
Common name | neodymium ruthenium indium germanide (4/2/1/4) |
Chemical name | neodymium ruthenium indium germanide (4/2/1/4) |
Formula | Ge4 In Nd4 Ru2 |
Calculated formula | Ge4 In0.954 Nd4 Ru2 |
Title of publication | Many Metals Make the Cut: Quaternary Rare-Earth Germanides RE4M2InGe4 (M = Fe, Co, Ni, Ru, Rh, Ir) and RE4RhInGe4 Derived from Excision of Slabs in RE2InGe2. |
Authors of publication | Oliynyk, Anton O.; Stoyko, Stanislav S.; Mar, Arthur |
Journal of publication | Inorganic chemistry |
Year of publication | 2015 |
Journal volume | 54 |
Journal issue | 6 |
Pages of publication | 2780 - 2792 |
a | 16.014 ± 0.006 Å |
b | 4.3463 ± 0.0016 Å |
c | 7.16 ± 0.003 Å |
α | 90° |
β | 106.353 ± 0.005° |
γ | 90° |
Cell volume | 478.2 ± 0.3 Å3 |
Cell temperature | 173 ± 2 K |
Ambient diffraction temperature | 173 ± 2 K |
Number of distinct elements | 4 |
Space group number | 12 |
Hermann-Mauguin space group symbol | C 1 2/m 1 |
Hall space group symbol | -C 2y |
Residual factor for all reflections | 0.035 |
Residual factor for significantly intense reflections | 0.0244 |
Weighted residual factors for significantly intense reflections | 0.0498 |
Weighted residual factors for all reflections included in the refinement | 0.0529 |
Goodness-of-fit parameter for all reflections included in the refinement | 1.035 |
Diffraction radiation wavelength | 0.71073 Å |
Diffraction radiation type | MoKα |