Information card for entry 4342575
Common name | gadolinium ruthenium indium germanide (4/2/1/4) |
Chemical name | gadolinium ruthenium indium germanide (4/2/1/4) |
Formula | Gd4 Ge4 In Ru2 |
Calculated formula | Gd4 Ge4 In0.962 Ru2 |
Title of publication | Many Metals Make the Cut: Quaternary Rare-Earth Germanides RE4M2InGe4 (M = Fe, Co, Ni, Ru, Rh, Ir) and RE4RhInGe4 Derived from Excision of Slabs in RE2InGe2. |
Authors of publication | Oliynyk, Anton O.; Stoyko, Stanislav S.; Mar, Arthur |
Journal of publication | Inorganic chemistry |
Year of publication | 2015 |
Journal volume | 54 |
Journal issue | 6 |
Pages of publication | 2780 - 2792 |
a | 15.773 ± 0.004 Å |
b | 4.2875 ± 0.0011 Å |
c | 7.0393 ± 0.0018 Å |
α | 90° |
β | 106.635 ± 0.004° |
γ | 90° |
Cell volume | 456.1 ± 0.2 Å3 |
Cell temperature | 173 ± 2 K |
Ambient diffraction temperature | 173 ± 2 K |
Number of distinct elements | 4 |
Space group number | 12 |
Hermann-Mauguin space group symbol | C 1 2/m 1 |
Hall space group symbol | -C 2y |
Residual factor for all reflections | 0.0353 |
Residual factor for significantly intense reflections | 0.024 |
Weighted residual factors for significantly intense reflections | 0.0406 |
Weighted residual factors for all reflections included in the refinement | 0.0437 |
Goodness-of-fit parameter for all reflections included in the refinement | 1.047 |
Diffraction radiation wavelength | 0.71073 Å |
Diffraction radiation type | MoKα |