Information card for entry 4342577
Common name | dysprosium ruthenium indium germanide (4/2/1/4) |
Chemical name | dysprosium ruthenium indium germanide (4/2/1/4) |
Formula | Dy4 Ge4 In Ru2 |
Calculated formula | Dy4 Ge4 In0.961 Ru2 |
Title of publication | Many Metals Make the Cut: Quaternary Rare-Earth Germanides RE4M2InGe4 (M = Fe, Co, Ni, Ru, Rh, Ir) and RE4RhInGe4 Derived from Excision of Slabs in RE2InGe2. |
Authors of publication | Oliynyk, Anton O.; Stoyko, Stanislav S.; Mar, Arthur |
Journal of publication | Inorganic chemistry |
Year of publication | 2015 |
Journal volume | 54 |
Journal issue | 6 |
Pages of publication | 2780 - 2792 |
a | 15.612 ± 0.003 Å |
b | 4.2519 ± 0.0009 Å |
c | 6.9641 ± 0.0015 Å |
α | 90° |
β | 106.728 ± 0.003° |
γ | 90° |
Cell volume | 442.72 ± 0.16 Å3 |
Cell temperature | 173 ± 2 K |
Ambient diffraction temperature | 173 ± 2 K |
Number of distinct elements | 4 |
Space group number | 12 |
Hermann-Mauguin space group symbol | C 1 2/m 1 |
Hall space group symbol | -C 2y |
Residual factor for all reflections | 0.0294 |
Residual factor for significantly intense reflections | 0.0235 |
Weighted residual factors for significantly intense reflections | 0.0496 |
Weighted residual factors for all reflections included in the refinement | 0.0514 |
Goodness-of-fit parameter for all reflections included in the refinement | 1.057 |
Diffraction radiation wavelength | 0.71073 Å |
Diffraction radiation type | MoKα |