Information card for entry 4342582
Common name | praseodymium iron indium germanide (4/2/1/4) |
Chemical name | praseodymium iron indium germanide (4/2/1/4) |
Formula | Fe2 Ge4 In Pr4 |
Calculated formula | Fe2 Ge4 In0.974 Pr4 |
Title of publication | Many Metals Make the Cut: Quaternary Rare-Earth Germanides RE4M2InGe4 (M = Fe, Co, Ni, Ru, Rh, Ir) and RE4RhInGe4 Derived from Excision of Slabs in RE2InGe2. |
Authors of publication | Oliynyk, Anton O.; Stoyko, Stanislav S.; Mar, Arthur |
Journal of publication | Inorganic chemistry |
Year of publication | 2015 |
Journal volume | 54 |
Journal issue | 6 |
Pages of publication | 2780 - 2792 |
a | 16.0089 ± 0.0012 Å |
b | 4.3242 ± 0.0003 Å |
c | 7.2282 ± 0.0005 Å |
α | 90° |
β | 106.877 ± 0.001° |
γ | 90° |
Cell volume | 478.83 ± 0.06 Å3 |
Cell temperature | 173 ± 2 K |
Ambient diffraction temperature | 173 ± 2 K |
Number of distinct elements | 4 |
Space group number | 12 |
Hermann-Mauguin space group symbol | C 1 2/m 1 |
Hall space group symbol | -C 2y |
Residual factor for all reflections | 0.0282 |
Residual factor for significantly intense reflections | 0.0202 |
Weighted residual factors for significantly intense reflections | 0.037 |
Weighted residual factors for all reflections included in the refinement | 0.039 |
Goodness-of-fit parameter for all reflections included in the refinement | 1.006 |
Diffraction radiation wavelength | 0.71073 Å |
Diffraction radiation type | MoKα |