Information card for entry 4342584
Common name | samarium iron indium germanide (4/2/1/4) |
Chemical name | samarium iron indium germanide (4/2/1/4) |
Formula | Fe2 Ge4 In Sm4 |
Calculated formula | Fe2 Ge4 In0.964 Sm4 |
Title of publication | Many Metals Make the Cut: Quaternary Rare-Earth Germanides RE4M2InGe4 (M = Fe, Co, Ni, Ru, Rh, Ir) and RE4RhInGe4 Derived from Excision of Slabs in RE2InGe2. |
Authors of publication | Oliynyk, Anton O.; Stoyko, Stanislav S.; Mar, Arthur |
Journal of publication | Inorganic chemistry |
Year of publication | 2015 |
Journal volume | 54 |
Journal issue | 6 |
Pages of publication | 2780 - 2792 |
a | 15.77 ± 0.004 Å |
b | 4.2745 ± 0.0011 Å |
c | 7.1211 ± 0.0017 Å |
α | 90° |
β | 107.011 ± 0.003° |
γ | 90° |
Cell volume | 459 ± 0.2 Å3 |
Cell temperature | 173 ± 2 K |
Ambient diffraction temperature | 173 ± 2 K |
Number of distinct elements | 4 |
Space group number | 12 |
Hermann-Mauguin space group symbol | C 1 2/m 1 |
Hall space group symbol | -C 2y |
Residual factor for all reflections | 0.0254 |
Residual factor for significantly intense reflections | 0.0199 |
Weighted residual factors for significantly intense reflections | 0.0396 |
Weighted residual factors for all reflections included in the refinement | 0.0412 |
Goodness-of-fit parameter for all reflections included in the refinement | 1.073 |
Diffraction radiation wavelength | 0.71073 Å |
Diffraction radiation type | MoKα |