Information card for entry 4342588
Common name | neodymium cobalt indium germanide (4/2/1/4) |
Chemical name | neodymium cobalt indium germanide (4/2/1/4) |
Formula | Co2 Ge4 In Nd4 |
Calculated formula | Co2 Ge4 In0.965 Nd4 |
Title of publication | Many Metals Make the Cut: Quaternary Rare-Earth Germanides RE4M2InGe4 (M = Fe, Co, Ni, Ru, Rh, Ir) and RE4RhInGe4 Derived from Excision of Slabs in RE2InGe2. |
Authors of publication | Oliynyk, Anton O.; Stoyko, Stanislav S.; Mar, Arthur |
Journal of publication | Inorganic chemistry |
Year of publication | 2015 |
Journal volume | 54 |
Journal issue | 6 |
Pages of publication | 2780 - 2792 |
a | 15.7845 ± 0.0009 Å |
b | 4.3028 ± 0.0003 Å |
c | 7.1824 ± 0.0004 Å |
α | 90° |
β | 107.511 ± 0.0008° |
γ | 90° |
Cell volume | 465.2 ± 0.05 Å3 |
Cell temperature | 173 ± 2 K |
Ambient diffraction temperature | 173 ± 2 K |
Number of distinct elements | 4 |
Space group number | 12 |
Hermann-Mauguin space group symbol | C 1 2/m 1 |
Hall space group symbol | -C 2y |
Residual factor for all reflections | 0.0244 |
Residual factor for significantly intense reflections | 0.0185 |
Weighted residual factors for significantly intense reflections | 0.0354 |
Weighted residual factors for all reflections included in the refinement | 0.0366 |
Goodness-of-fit parameter for all reflections included in the refinement | 1.053 |
Diffraction radiation wavelength | 0.71073 Å |
Diffraction radiation type | MoKα |