Information card for entry 4342593
Formula | C49 H24 F23 Fe N12 S2 |
Calculated formula | C49 H24 F23 Fe N12 S2 |
Title of publication | "Tail" Tuning of Iron(II) Spin Crossover Temperature by 100 K. |
Authors of publication | Feltham, Humphrey L. C.; Johnson, Chloe; Elliott, Anastasia B. S.; Gordon, Keith C.; Albrecht, Martin; Brooker, Sally |
Journal of publication | Inorganic chemistry |
Year of publication | 2015 |
Journal volume | 54 |
Journal issue | 6 |
Pages of publication | 2902 - 2909 |
a | 11.3784 ± 0.0003 Å |
b | 12.1968 ± 0.0003 Å |
c | 21.7151 ± 0.001 Å |
α | 95.764 ± 0.003° |
β | 92.987 ± 0.003° |
γ | 95.902 ± 0.002° |
Cell volume | 2976.55 ± 0.18 Å3 |
Cell temperature | 100 ± 2 K |
Ambient diffraction temperature | 100 ± 2 K |
Number of distinct elements | 6 |
Space group number | 2 |
Hermann-Mauguin space group symbol | P -1 |
Hall space group symbol | -P 1 |
Residual factor for all reflections | 0.1313 |
Residual factor for significantly intense reflections | 0.089 |
Weighted residual factors for significantly intense reflections | 0.2342 |
Weighted residual factors for all reflections included in the refinement | 0.2506 |
Goodness-of-fit parameter for all reflections included in the refinement | 1.352 |
Diffraction radiation wavelength | 0.71073 Å |
Diffraction radiation type | MoKα |