Information card for entry 4342634
Formula | C70 H158 Al Br Mo6 N4 O24 |
Calculated formula | C70 H157 Al Br Mo6 N4 O24 |
Title of publication | Step-by-Step Strategy from Achiral Precursors to Polyoxometalates-Based Chiral Organic-Inorganic Hybrids. |
Authors of publication | Zhang, Jiangwei; Luo, Jianhui; Wang, Pingmei; Ding, Bin; Huang, Yichao; Zhao, Zhenlin; Zhang, Jin; Wei, Yongge |
Journal of publication | Inorganic chemistry |
Year of publication | 2015 |
Journal volume | 54 |
Journal issue | 6 |
Pages of publication | 2551 - 2559 |
a | 15.9787 ± 0.0003 Å |
b | 15.8012 ± 0.0003 Å |
c | 18.1275 ± 0.0003 Å |
α | 90° |
β | 93.177 ± 0.0018° |
γ | 90° |
Cell volume | 4569.84 ± 0.14 Å3 |
Cell temperature | 103 ± 9 K |
Ambient diffraction temperature | 103 ± 9 K |
Number of distinct elements | 7 |
Space group number | 4 |
Hermann-Mauguin space group symbol | P 1 21 1 |
Hall space group symbol | P 2yb |
Residual factor for all reflections | 0.0565 |
Residual factor for significantly intense reflections | 0.0445 |
Weighted residual factors for significantly intense reflections | 0.0841 |
Weighted residual factors for all reflections included in the refinement | 0.107 |
Goodness-of-fit parameter for all reflections included in the refinement | 1.018 |
Diffraction radiation wavelength | 1.54184 Å |
Diffraction radiation type | CuKα |