Information card for entry 4342641
Formula | C16 H14 Co N4 O2 S2 |
Calculated formula | C16 H14 Co N4 O2 S2 |
Title of publication | Thermodynamically metastable thiocyanato coordination polymer that shows slow relaxations of the magnetization. |
Authors of publication | Werner, Julia; Rams, Michał; Tomkowicz, Zbigniew; Runčevski, Tomče; Dinnebier, Robert E.; Suckert, Stefan; Näther, Christian |
Journal of publication | Inorganic chemistry |
Year of publication | 2015 |
Journal volume | 54 |
Journal issue | 6 |
Pages of publication | 2893 - 2901 |
a | 9.5315 ± 0.0003 Å |
b | 15.8242 ± 0.0004 Å |
c | 24.3712 ± 0.0006 Å |
α | 90° |
β | 90° |
γ | 90° |
Cell volume | 3675.87 ± 0.17 Å3 |
Cell temperature | 293 ± 2 K |
Ambient diffraction temperature | 293 ± 2 K |
Number of distinct elements | 6 |
Space group number | 61 |
Hermann-Mauguin space group symbol | P b c a |
Hall space group symbol | -P 2ac 2ab |
Residual factor for all reflections | 0.0677 |
Residual factor for significantly intense reflections | 0.0539 |
Weighted residual factors for significantly intense reflections | 0.0921 |
Weighted residual factors for all reflections included in the refinement | 0.0962 |
Goodness-of-fit parameter for all reflections included in the refinement | 1.262 |
Diffraction radiation wavelength | 0.71073 Å |
Diffraction radiation type | MoKα |