Information card for entry 4342655
Formula | C36 H36 N8 Ni O0.5 |
Calculated formula | C36 H36 N8 Ni O0.5 |
Title of publication | Synthesis and Structural Studies of Nickel(0) Tetracarbene Complexes with the Introduction of a New Four-Coordinate Geometric Index, τδ. |
Authors of publication | Reineke, Mark H.; Sampson, Matthew D.; Rheingold, Arnold L.; Kubiak, Clifford P. |
Journal of publication | Inorganic chemistry |
Year of publication | 2015 |
Journal volume | 54 |
Journal issue | 7 |
Pages of publication | 3211 - 3217 |
a | 10.5571 ± 0.0012 Å |
b | 15.6353 ± 0.0017 Å |
c | 37.582 ± 0.004 Å |
α | 90° |
β | 90° |
γ | 90° |
Cell volume | 6203.4 ± 1.2 Å3 |
Cell temperature | 273 ± 2 K |
Ambient diffraction temperature | 273.15 K |
Number of distinct elements | 5 |
Space group number | 61 |
Hermann-Mauguin space group symbol | P b c a |
Hall space group symbol | -P 2ac 2ab |
Residual factor for all reflections | 0.0722 |
Residual factor for significantly intense reflections | 0.0399 |
Weighted residual factors for significantly intense reflections | 0.0874 |
Weighted residual factors for all reflections included in the refinement | 0.1059 |
Goodness-of-fit parameter for all reflections included in the refinement | 1.039 |
Diffraction radiation probe | x-ray |
Diffraction radiation wavelength | 0.71073 Å |
Diffraction radiation type | MoKα |
Diffraction radiation X-ray symbol | K-L~3~ |