Information card for entry 4342675
Formula | C84 H70 Co9 N6 O50 P6 |
Calculated formula | C84 H54 Co9 N6 O50 P6 |
Title of publication | A three-dimensional complex with a one-dimensional cobalt-hydroxyl chain based on planar nonanuclear clusters showing spin-canted antiferromagnetism. |
Authors of publication | Li, Bao; Li, Zhao; Wei, Rong-Jia; Yu, Fan; Chen, Xi; Xie, Yun-Peng; Zhang, Tian-le; Tao, Jun |
Journal of publication | Inorganic chemistry |
Year of publication | 2015 |
Journal volume | 54 |
Journal issue | 7 |
Pages of publication | 3331 - 3336 |
a | 17.658 ± 0.0011 Å |
b | 9.1133 ± 0.0006 Å |
c | 29.517 ± 0.002 Å |
α | 90° |
β | 97.387 ± 0.003° |
γ | 90° |
Cell volume | 4710.5 ± 0.5 Å3 |
Cell temperature | 304 ± 2 K |
Ambient diffraction temperature | 304 ± 2 K |
Number of distinct elements | 6 |
Space group number | 14 |
Hermann-Mauguin space group symbol | P 1 21/c 1 |
Hall space group symbol | -P 2ybc |
Residual factor for all reflections | 0.1502 |
Residual factor for significantly intense reflections | 0.0599 |
Weighted residual factors for significantly intense reflections | 0.112 |
Weighted residual factors for all reflections included in the refinement | 0.136 |
Goodness-of-fit parameter for all reflections included in the refinement | 0.991 |
Diffraction radiation wavelength | 0.71073 Å |
Diffraction radiation type | MoKα |