Information card for entry 4342677
Formula | C29 H34 F12 Fe N5 O P2 |
Calculated formula | C29 H34 F12 Fe N5 O P2 |
SMILES | c1cccc2C[N]34Cc5cccc[n]5[Fe]54([n]12)([N](CC3)(Cc1cccc[n]51)Cc1ccccc1)OCC.[P](F)(F)(F)(F)(F)[F-].[P](F)(F)(F)(F)(F)[F-] |
Title of publication | Spin Crossover Behavior in a Series of Iron(III) Alkoxide Complexes. |
Authors of publication | Ortega-Villar, Norma; Guerrero-Estrada, Areli Yesareth; Piñeiro-López, Lucía; Muñoz, M Carmen; Flores-Álamo, Marcos; Moreno-Esparza, Rafael; Real, José A; Ugalde-Saldívar, Víctor M |
Journal of publication | Inorganic chemistry |
Year of publication | 2015 |
Journal volume | 54 |
Journal issue | 7 |
Pages of publication | 3413 - 3421 |
a | 17.8729 ± 0.0004 Å |
b | 18.8767 ± 0.0004 Å |
c | 19.5847 ± 0.0004 Å |
α | 90° |
β | 90° |
γ | 90° |
Cell volume | 6607.5 ± 0.2 Å3 |
Cell temperature | 130 ± 2 K |
Ambient diffraction temperature | 130 ± 2 K |
Number of distinct elements | 7 |
Space group number | 61 |
Hermann-Mauguin space group symbol | P b c a |
Hall space group symbol | -P 2ac 2ab |
Residual factor for all reflections | 0.0481 |
Residual factor for significantly intense reflections | 0.0361 |
Weighted residual factors for significantly intense reflections | 0.0967 |
Weighted residual factors for all reflections included in the refinement | 0.101 |
Goodness-of-fit parameter for all reflections included in the refinement | 1.068 |
Diffraction radiation wavelength | 0.71073 Å |
Diffraction radiation type | MoKα |