Information card for entry 4342686
Formula | C29 H34 F12 Fe N5 O2 P2 |
Calculated formula | C29 H34 F12 Fe N5 O2 P2 |
SMILES | c1cccc2C[N]34Cc5cccc[n]5[Fe]54([n]12)([N](CC3)(Cc1ccccc1)Cc1cccc[n]51)OCCO.[P](F)(F)(F)(F)(F)[F-].[P](F)(F)(F)(F)(F)[F-] |
Title of publication | Spin Crossover Behavior in a Series of Iron(III) Alkoxide Complexes. |
Authors of publication | Ortega-Villar, Norma; Guerrero-Estrada, Areli Yesareth; Piñeiro-López, Lucía; Muñoz, M Carmen; Flores-Álamo, Marcos; Moreno-Esparza, Rafael; Real, José A; Ugalde-Saldívar, Víctor M |
Journal of publication | Inorganic chemistry |
Year of publication | 2015 |
Journal volume | 54 |
Journal issue | 7 |
Pages of publication | 3413 - 3421 |
a | 18.0743 ± 0.0008 Å |
b | 19.245 ± 0.001 Å |
c | 19.7958 ± 0.0008 Å |
α | 90° |
β | 90° |
γ | 90° |
Cell volume | 6885.8 ± 0.5 Å3 |
Cell temperature | 298 ± 2 K |
Ambient diffraction temperature | 298 ± 2 K |
Number of distinct elements | 7 |
Space group number | 61 |
Hermann-Mauguin space group symbol | P b c a |
Hall space group symbol | -P 2ac 2ab |
Residual factor for all reflections | 0.1153 |
Residual factor for significantly intense reflections | 0.0673 |
Weighted residual factors for significantly intense reflections | 0.1678 |
Weighted residual factors for all reflections included in the refinement | 0.2008 |
Goodness-of-fit parameter for all reflections included in the refinement | 1.034 |
Diffraction radiation wavelength | 0.71073 Å |
Diffraction radiation type | MoKα |