Information card for entry 4342688
Formula | C50 H90 N12 O29 P4 Pd12 S |
Calculated formula | C50 H90 N12 O29 P4 Pd12 S |
Title of publication | A Neutral Cluster Cage with a Tetrahedral [Pd12IIL6] Framework: Crystal Structures and Host‒Guest Studies |
Authors of publication | Gupta, Arvind K.; Yadav, Ashok; Srivastava, Anant Kumar; Ramya, Kormathmadam Raghupathy; Paithankar, Harshad; Nandi, Shyamapada; Chugh, Jeetender; Boomishankar, Ramamoorthy |
Journal of publication | Inorganic chemistry |
Year of publication | 2015 |
Pages of publication | 150317143949001 |
a | 17.7807 ± 0.0017 Å |
b | 23.911 ± 0.002 Å |
c | 29.895 ± 0.003 Å |
α | 90° |
β | 107.274 ± 0.002° |
γ | 90° |
Cell volume | 12137 ± 2 Å3 |
Cell temperature | 100 ± 2 K |
Ambient diffraction temperature | 100 ± 2 K |
Number of distinct elements | 7 |
Space group number | 14 |
Hermann-Mauguin space group symbol | P 1 21/c 1 |
Hall space group symbol | -P 2ybc |
Residual factor for all reflections | 0.1386 |
Residual factor for significantly intense reflections | 0.0545 |
Weighted residual factors for significantly intense reflections | 0.1166 |
Weighted residual factors for all reflections included in the refinement | 0.1291 |
Goodness-of-fit parameter for all reflections included in the refinement | 0.862 |
Diffraction radiation wavelength | 0.71073 Å |
Diffraction radiation type | MoKα |