Information card for entry 4342702
Formula | C38 H30 Cl2 N6 O8 Ru |
Calculated formula | C38 H30 Cl2 N6 O8 Ru |
Title of publication | Ancillary Ligand Control of Electronic Structure in o-Benzoquinonediimine-Ruthenium Complex Redox Series: Structures, Electron Paramagnetic Resonance (EPR), and Ultraviolet-Visible-Near-Infrared (UV-vis-NIR) Spectroelectrochemistry. |
Authors of publication | Das, Ankita; Ghosh, Prabir; Plebst, Sebastian; Schwederski, Brigitte; Mobin, Shaikh M.; Kaim, Wolfgang; Lahiri, Goutam Kumar |
Journal of publication | Inorganic chemistry |
Year of publication | 2015 |
Journal volume | 54 |
Journal issue | 7 |
Pages of publication | 3376 - 3386 |
a | 11.9299 ± 0.0003 Å |
b | 22.0897 ± 0.0004 Å |
c | 13.7578 ± 0.0004 Å |
α | 90° |
β | 94.217 ± 0.002° |
γ | 90° |
Cell volume | 3615.75 ± 0.15 Å3 |
Cell temperature | 150 ± 2 K |
Ambient diffraction temperature | 150 ± 2 K |
Number of distinct elements | 6 |
Space group number | 15 |
Hermann-Mauguin space group symbol | C 1 2/c 1 |
Hall space group symbol | -C 2yc |
Residual factor for all reflections | 0.0777 |
Residual factor for significantly intense reflections | 0.0654 |
Weighted residual factors for significantly intense reflections | 0.1831 |
Weighted residual factors for all reflections included in the refinement | 0.2063 |
Goodness-of-fit parameter for all reflections included in the refinement | 1.076 |
Diffraction radiation wavelength | 0.71073 Å |
Diffraction radiation type | MoKα |