Information card for entry 4342704
Formula | F3 H6 Na Ni O3 |
Calculated formula | F3 H6 Na Ni O3 |
Title of publication | Synthesis and Characterization of NaNiF3·3H2O: An Unusual Ordered Variant of the ReO3 Type. |
Authors of publication | Gonzalo, Elena C.; Sanjuán, María Luisa; Hoelzel, Markus; Azcondo, M. Teresa; Amador, Ulises; Sobrados, Isabel; Sanz, Jesús; García-Alvarado, Flaviano; Kuhn, Alois |
Journal of publication | Inorganic chemistry |
Year of publication | 2015 |
Journal volume | 54 |
Journal issue | 7 |
Pages of publication | 3172 - 3182 |
a | 7.92133 ± 0.00006 Å |
b | 7.92133 ± 0.00006 Å |
c | 7.92133 ± 0.00006 Å |
α | 90° |
β | 90° |
γ | 90° |
Cell volume | 497.043 ± 0.007 Å3 |
Cell temperature | 298 K |
Ambient diffraction temperature | 298 K |
Number of distinct elements | 5 |
Space group number | 201 |
Hermann-Mauguin space group symbol | P n -3 :2 |
Hall space group symbol | -P 2ab 2bc 3 |
Residual factor for all reflections | 0.0064 |
Weighted residual factors for all reflections | 0.0079 |
Residual factor R(I) for significantly intense reflections | 0.024 |
Goodness-of-fit parameter for all reflections | 1.79 |
Method of determination | powder diffraction |
Diffraction radiation probe | neutron |
Diffraction radiation wavelength | 1.54833 Å |
Diffraction radiation type | neutron |